ITPub博客

首页 > 大数据 > Hadoop > ubuntu安装oracle 11gr2遇到的问题

ubuntu安装oracle 11gr2遇到的问题

Hadoop 作者:gdxds123456 时间:2013-05-11 11:29:47 0 删除 编辑

download from net ,study for myself

ubuntu安装oracle 11gr2遇到的问题

分类: oracle install 2012-11-02 12:21 493人阅读 评论(0) 收藏 举报
ERROR 1

INFO: Exception thrown from action: make
Exception Name: MakefileException
INFO: make: *** [client_sharedlib] 
解决办法:
sudo mkdir /usr/lib64
ln -s /usr/lib/x86_64-linux-gnu/libpthread_nonshared.a /usr/lib64/libpthread_nonshared.a


ERROR 2

INFO: /ld: cannot find /usr/lib64/libc_nonshared.a
INFO: make: *** [libc_nonshared

解决办法:
sudo mkdir /usr/lib64
ln --s /lib/x86_64-linux-gnu/libc_nonshared.a /usr/lib64/libc_nonshared.a


ERROR 3

INFO: Exception thrown from action: make
Exception Name: MakefileException
Exception String: Error in invoking target 'idg4odbc' of makefile '/opt/app/oracle/product/11.2/db_1/rdbms/lib/ins_rdbms.mk'. See '/opt/app/oraInventory/logs/installActions2012-11-02_12-00-26PM.log' for details.
Exception Severity: 1
INFO: Adding ExitStatus STOP_INSTALL to the exit status set
INFO: Finding the most appropriate exit status for the current application
INFO: Exit Status is -4
INFO: Shutdown Oracle Database 11g Release 2 Installer
INFO: Unloading Setup Driver

解决办法:

sudo apt-get install gcc++

ln -s /usr/bin/basename /bin/basename



ERROR 4

INFO: make: *** [ctxhx] 


INFO: End output from spawned process.
INFO: ----------------------------------
INFO: Exception thrown from action: make
Exception Name: MakefileException
Exception String: Error in invoking target 'install' of makefile '/opt/app/oracle/product/11.2/db_1/ctx/lib/ins_ctx.mk'. See '/opt/app/oraInventory/logs/installActions2012-11-02_12-26-30PM.log' for details.
Exception Severity: 1


sudo apt-get install gcc-multilib

sudo apt-get install libstdc++5


ERROR 5

make: *** [emdctl] 


INFO: End output from spawned process.
INFO: ----------------------------------
INFO: Exception thrown from action: make
Exception Name: MakefileException
Exception String: Error in invoking target 'agent nmhs' of makefile '/opt/app/oracle/product/11.2/db_1/sysman/lib/ins_emagent.mk'. See '/opt/app/oraInventory/logs/installActions2012-11-02_12-26-30PM.log' for details.
Exception Severity: 1





ERROR 6

INFO: make: *** [liborasdkbase] 


INFO: End output from spawned process.
INFO: ----------------------------------
INFO: Exception thrown from action: make
Exception Name: MakefileException
Exception String: Error in invoking target 'all_no_orcl' of makefile '/opt/app/oracle/product/11.2/db_1/rdbms/lib/ins_rdbms.mk'. See '/opt/app/oraInventory/logs/installActions2012-11-02_12-26-30PM.log' for details.
Exception Severity: 1
<!-- 正文结束 -->

来自 “ ITPUB博客 ” ,链接:http://blog.itpub.net/21369343/viewspace-1118071/,如需转载,请注明出处,否则将追究法律责任。

上一篇: 没有了~
下一篇: 没有了~
请登录后发表评论 登录
全部评论

注册时间:2009-04-12